�s���{���R�[�h,No,�s���{����,�s�撬����,����,�ǂ݉����i�J�i�j,����_�p��,����_�ʏ�,POI�R�[�h,���,�X�֔ԍ�,�Z���i�s���{���j,�Z���i�s�撬���j,�Z���i�����Ԓn�j,�Z���i�������E�����j,�ܓx,�o�x,�d�b�ԍ�,�d�b�ԍ����ӏ���,�@�l�ԍ�,�c�̖��i�{�݊Ǘ��c�́j,���p�\�j��,��x��,��x���ڍ�,�J�n����,�I������,���p�\���ԓ��L����,�����i��{�j,�����i�ڍׁj,��ʃA�N�Z�X,�߂��̉w�i�R�܂Łj,�w����߂��i1���L�A0�����j,���ԏꂠ��i1���L�A0�����j,���ԏꗿ��,���ԉ\�䐔,���ԏ�ڍ�,�o���A�t���[���,URL,�x�r�[�J�[OK�i1��OK�A0��NG�j,�x�r�[�J�[�u���ꂠ��i1���L�A0�����j,�I���c������i1���L�A0�����j,����������i1���L�A0�����j,����������i1���L�A0�����j,�H����������OK�i1��OK�A0��NG�j,���X�g��������i1���L�A0�����j,���X����i1���L�A0�����j,�J�ł�OK�i1��OK�A0��NG�j,�摜,�摜_���C�Z���X,���l,�ŏI�X�V��
92142,1,�Ȗ،�,������s,�����E�^�S�[�����a�L�O����,�J���|�E�^�S�[���w�C���L�l���R�E�G��,,,,����,329-1311,�Ȗ،�,������s,����2662-1,,36.680675,139.967364,(028)681-1120,������s�s�s������,,������s,���ΐ��؋��y��,�Ȃ�,,,,,����,,���Ɖw����Ԃ�4��,JR���Ɖw,0,0,,,,,,1,0,0,0,0,1,0,0,0,,,,2021�N5��31��
92142,2,�Ȗ،�,������s,�����1����,�N�T�K���_�C�C�`�R�E�G��,,,,����,329-1324,�Ȗ،�,������s,����18-1,,36.686702,139.94833,(028)681-1120,������s�s�s������,,������s,���ΐ��؋��y��,�Ȃ�,,,,,����,,���Ɖw����Ԃ�5��,JR���Ɖw,0,0,,,,,,1,0,0,0,0,1,0,0,0,,,,2021�N5��31��
92142,3,�Ȗ،�,������s,�����2����,�N�T�K���_�C�j�R�E�G��,,,,����,329-1324,�Ȗ،�,������s,����57-1,,36.678728,139.956779,(028)681-1120,������s�s�s������,,������s,���ΐ��؋��y��,�Ȃ�,,,,,����,,���Ɖw����Ԃ�5��,JR���Ɖw,0,0,,,,,,1,0,0,0,0,1,0,0,0,,,,2021�N5��31��
92142,4,�Ȗ،�,������s,���Ɖw��1������,�E�W�C�G�G�L�j�V�C�`�S�E�R�E�G��,,,,����,329-1322,�Ȗ،�,������s,�k����1����6-6,,36.688546,139.952069,(028)681-1120,������s�s�s������,,������s,���ΐ��؋��y��,�Ȃ�,,,,,����,,���Ɖw����Ԃ�4��,JR���Ɖw,0,0,,,,,,1,0,0,0,0,1,0,0,0,,,,2021�N5��31��
92142,5,�Ȗ،�,������s,���Ɖw��2������,�E�W�C�G�G�L�j�V�j�S�E�R�E�G��,,,,����,329-1323,�Ȗ،�,������s,�K�̗�2����25-3,,36.683131,139.959513,(028)681-1120,������s�s�s������,,������s,���ΐ��؋��y��,�Ȃ�,,,,,����,,���Ɖw����Ԃ�2��,JR���Ɖw,1,0,,,,,,1,0,0,0,0,1,0,0,0,,,,2021�N5��31��
92142,6,�Ȗ،�,������s,���Ɖw��3������,�E�W�C�G�G�L�j�V�T���S�E�R�E�G��,,,,����,329-1323,�Ȗ،�,������s,�K�̗�4����53-6,,36.678602,139.95948,(028)681-1120,������s�s�s������,,������s,���ΐ��؋��y��,�Ȃ�,,,,,����,,���Ɖw����Ԃ�3��,JR���Ɖw,1,0,,,,,,1,0,0,0,0,1,0,0,0,,,,2021�N5��31��
92142,7,�Ȗ،�,������s,���Ɖw��4������,�E�W�C�G�G�L�j�V�����S�E�R�E�G��,,,,����,329-1323,�Ȗ،�,������s,�K�̗�5����62-3,,36.677659,139.962342,(028)681-1120,������s�s�s������,,������s,���ΐ��؋��y��,�Ȃ�,,,,,����,,���Ɖw����Ԃ�2��,JR���Ɖw,1,0,,,,,,1,0,0,0,0,1,0,0,0,,,,2021�N5��31��
92142,8,�Ȗ،�,������s,���Ɖw���ߗ׌���,�E�W�C�G�G�L�j�V�L�������R�E�G��,,���̋u����,,����,329-1323,�Ȗ،�,������s,�K�̗�1����8,,36.684723,139.956856,(028)681-1120,������s�s�s������,,������s,���ΐ��؋��y��,�Ȃ�,,,,,����,,���Ɖw����Ԃ�4��,JR���Ɖw,0,0,,,,,,1,0,0,0,0,1,0,0,0,,,,2021�N5��31��
92142,9,�Ȗ،�,������s,�S�{��^������,�L�k�K���E�����h�E�R�E�G��,,,,����,329-1326,�Ȗ،�,������s,���͌�4101,,36.69734333,139.9366208,(028)681-1120,������s�s�s������,,������s,���ΐ��؋��y��,�Ȃ�,,,,,����,,���Ɖw����Ԃ�7��,JR���Ɖw,0,1,0,,,,,1,0,0,0,0,1,0,0,0,,,,2021�N5��31��
92142,10,�Ȗ،�,������s,�S�{��͐����,�L�k�K���J�Z���R�E�G��,,�䂤�䂤�p�[�N,,����,329-1311,�Ȗ،�,������s,����1317,,36.67368927,139.9523848,(028)681-1120,������s�s�s������,,������s,���ΐ��؋��y��,�Ȃ�,,,,,����,,���Ɖw����Ԃ�5��,JR���Ɖw,0,1,0,,,�G���x�[�^�[�ƃX���[�v����,,1,0,0,0,0,1,0,0,0,,,,2021�N5��31��
92142,11,�Ȗ،�,������s,���ێR����,�I�}�����}�R�E�G��,,,,����,329-1412,�Ȗ،�,������s,��A��5481-1,,36.71877,140.020579,(028)681-1120,������s�s�s������,,������s,���ΐ��؋��y��,�Ȃ�,,,,,����,,���Ɖw����Ԃ�17��,JR���Ɖw,0,0,,,,,,1,0,0,0,0,1,0,0,0,,,,2021�N5��31��
92142,12,�Ȗ،�,������s,�Ҋ������,�V���E�u�U���R�E�G��,,,,����,329-1405,�Ȗ،�,������s,���}62-2,,36.73883695,140.0327448,(028)681-1120,������s�s�s������,,������s,���ΐ��؋��y��,�Ȃ�,,,,,����,,���Ɖw����Ԃ�20��,JR���Ɖw,0,1,0,,,,,1,0,0,0,0,1,0,0,0,,,,2021�N5��31��
92142,13,�Ȗ،�,������s,���R����,�J�c���}�R�E�G��,,,,����,329-1311,�Ȗ،�,������s,����1321,,36.66931454,139.9555896,(028)681-1120,������s�s�s������,,������s,���ΐ��؋��y��,�Ȃ�,,,,,����,,���Ɖw����Ԃ�5��,JR���Ɖw,0,0,,,,,,1,0,0,0,0,1,0,0,0,,,,2021�N5��31��
92142,14,�Ȗ،�,������s,��������,�\�E�S�E�R�E�G��,,,,����,329-1312,�Ȗ،�,������s,�N��1789,,36.69529402,139.982508,(028)681-1120,������s�s�s������,,������s,���ΐ��؋��y��,�Ȃ�,,,,,����,,���Ɖw����Ԃ�8��,JR���Ɖw,0,1,0,,,,,1,0,0,0,0,1,0,0,0,,,,2021�N5��31��
92142,15,�Ȗ،�,������s,�����X�����,�q�K�V�n���K�C�N�R�E�G��,,,,����,329-1312,�Ȗ،�,������s,�N��3405,,36.688425,139.970185,(028)681-1120,������s�s�s������,,������s,���ΐ��؋��y��,�Ȃ�,,,,,����,,���Ɖw����Ԃ�6��,JR���Ɖw,0,0,,,,,,1,0,0,0,0,1,0,0,0,,,,2021�N5��31��
92142,16,�Ȗ،�,������s,�㈢�v�Ñ�n�X�����1��,�J�~�A�N�c�_�C�`�K�C�N�R�E�G���C�`�S�E,,,,����,329-1316,�Ȗ،�,������s,�㈢�v��9�X��,,36.66144,139.958255,(028)681-1120,������s�s�s������,,������s,���ΐ��؋��y��,�Ȃ�,,,,,����,,���Ɖw����Ԃ�6��,JR���Ɖw,0,0,,,,,,1,0,0,0,0,1,0,0,0,,,,2021�N5��31��
92142,17,�Ȗ،�,������s,�㈢�v�Ñ�n�X�����2��,�J�~�A�N�c�_�C�`�K�C�N�R�E�G���j�S�E,,,,����,329-1316,�Ȗ،�,������s,�㈢�v��17�X��,,36.662236,139.961399,(028)681-1120,������s�s�s������,,������s,���ΐ��؋��y��,�Ȃ�,,,,,����,,���Ɖw����Ԃ�6��,JR���Ɖw,0,0,,,,,,1,0,0,0,0,1,0,0,0,,,,2021�N5��31��
92142,18,�Ȗ،�,������s,�㈢�v�Ñ�n�X�����3��,�J�~�A�N�c�_�C�`�K�C�N�R�E�G���T���S�E,,,,����,329-1316,�Ȗ،�,������s,�㈢�v��59�X��,,36.658247,139.958745,(028)681-1120,������s�s�s������,,������s,���ΐ��؋��y��,�Ȃ�,,,,,����,,���Ɖw����Ԃ�6��,JR���Ɖw,0,0,,,,,,1,0,0,0,0,1,0,0,0,,,,2021�N5��31��
92142,19,�Ȗ،�,������s,�㈢�v�Ñ�n�X�����4��,�J�~�A�N�c�_�C�`�K�C�N�R�E�G�������S�E,,,,����,329-1316,�Ȗ،�,������s,�㈢�v��32�X��,,36.660123,139.965845,(028)681-1120,������s�s�s������,,������s,���ΐ��؋��y��,�Ȃ�,,,,,����,,���Ɖw����Ԃ�6��,JR���Ɖw,0,0,,,,,,1,0,0,0,0,1,0,0,0,,,,2021�N5��31��
92142,20,�Ȗ،�,������s,�㈢�v�Ñ�n�X�����5��,�J�~�A�N�c�_�C�`�K�C�N�R�E�G���S�S�E,,,,����,329-1316,�Ȗ،�,������s,�㈢�v��98�X��,,36.654872,139.963028,(028)681-1120,������s�s�s������,,������s,���ΐ��؋��y��,�Ȃ�,,,,,����,,���Ɖw����Ԃ�8��,JR���Ɖw,0,0,,,,,,1,0,0,0,0,1,0,0,0,,,,2021�N5��31��
92142,21,�Ȗ،�,������s,�㈢�v�Ñ�n�ߗ׌���,�J�~�A�N�c�_�C�`�L�������R�E�G��,,,,����,329-1316,�Ȗ،�,������s,�㈢�v��79�X��,,36.658085,139.963712,(028)681-1120,������s�s�s������,,������s,���ΐ��؋��y��,�Ȃ�,,,,,����,,���Ɖw����Ԃ�7��,JR���Ɖw,0,1,0,,,�X���[�v����,,1,0,0,0,0,1,0,0,0,,,,2021�N5��31��
92142,22,�Ȗ،�,������s,�V���|�P�b�g�p�[�N,�V���}�`�|�P�b�g�p�[�N,,,,����,329-1311,�Ȗ،�,������s,����2765-13�A-14,,36.686551,139.966224,(028)681-1120,������s�s�s������,,������s,���ΐ��؋��y��,�Ȃ�,,,,,����,,���Ɖw����Ԃ�5��,JR���Ɖw,0,0,,,,,,1,0,0,0,0,1,0,0,0,,,,2021�N5��31��
92142,23,�Ȗ،�,������s,�Β����ԏ�|�P�b�g�p�[�N,�R�N�`���E�`���E�V���W���E�|�P�b�g�p�[�N,,,,����,329-1311,�Ȗ،�,������s,����2677�̓�,,36.682344,139.96693,(028)681-1120,������s�s�s������,,������s,���ΐ��؋��y��,�Ȃ�,,,,,����,,���Ɖw����Ԃ�4��,JR���Ɖw,0,0,,,,,,1,0,0,0,0,1,0,0,0,,,,2021�N5��31��
92142,24,�Ȗ،�,������s,���Ɖw��������,�E�W�C�G�G�L�q�K�V�O�`�R�E�G��,,,,����,329-1311,�Ȗ،�,������s,����1917-11,,36.680208,139.962811,(028)681-1120,������s�s�s������,,������s,���ΐ��؋��y��,�Ȃ�,,,,,����,,���Ɖw����Ԃ�2��,JR���Ɖw,1,0,,,,,,1,0,0,0,0,1,0,0,0,,,,2021�N5��31��
92142,25,�Ȗ،�,������s,�쌴������,�J���n���`���E�R�E�G��,,,,����,329-1321,�Ȗ،�,������s,�n��1018-4�A-5,,36.69715,139.947895,(028)681-1120,������s�s�s������,,������s,���ΐ��؋��y��,�Ȃ�,,,,,����,,���Ɖw����Ԃ�6��,JR���Ɖw,0,0,,,,,,1,0,0,0,0,1,0,0,0,,,,2021�N5��31��
92142,26,�Ȗ،�,������s,�܍s��͐����,�S�M���E�K���J�Z���R�E�G��,,,,����,329-1312,�Ȗ،�,������s,�N��1305-6,,36.681748,139.968058,(028)681-1120,������s�s�s������,,������s,���ΐ��؋��y��,�Ȃ�,,,,,����,,���Ɖw����Ԃ�5��,JR���Ɖw,0,0,,,,,,1,0,0,0,0,1,0,0,0,,,,2021�N5��31��
92142,27,�Ȗ،�,������s,�r�쐅�ӌ���,�A���J���~�Y�x�R�E�G��,,�W���C�t���u���[�p�[�N,,����,329-1412,�Ȗ،�,������s,��A��4183,,36.714394,140.032875,(028)681-1120,������s�s�s������,,������s,���ΐ��؋��y��,�Ȃ�,,,,,����,,���Ɖw����Ԃ�16��,JR���Ɖw,0,0,,,,,,1,0,0,0,0,1,0,0,0,,,,2021�N5��31��
